{"text_format":"1","workbook":"xlsx","n_sheets":10,"sheets":["Summary","Semester Summary","Therapy Hours","Supervision Hours","TOTAL Therapy","TOTAL Supervision","Formula Info","AmeriCorps","Definitions (September 2025)","Caseload Management"],"not_rendered":{"charts":0,"images":0,"macros":1,"external_links":0,"defined_names":0,"comments":0,"pivot_tables":0},"unopened":[],"bounds":{"document_bytes":16777216,"sheet_cells":100000,"rows_first":2000,"rows_last":500,"rows_between":2000,"halvings":0,"cell_chars":16384,"cell_head_chars":4096},"cells_cut":0,"cells_raw":0,"read":"whole","date_system":"1900"}

{"sheet":"Summary","index":0,"n_rows":32,"n_cols":13,"rows_kept":32,"cut":false,"hidden":false,"merged":[[31,2,31,3],[31,4,31,5],[27,3,27,4],[11,0,12,0],[23,0,24,0],[23,1,24,1],[23,2,23,5],[19,2,19,5],[22,2,22,5],[0,0,0,7],[11,1,12,1],[11,2,11,5],[13,8,13,12],[7,0,7,1],[10,2,10,5],[8,0,8,1],[9,0,9,1],[3,0,3,1],[4,0,4,1],[5,0,5,1],[6,0,6,1],[1,0,2,1]]}
["Semester Clinical Experience Summary"]
[]
[]
["THERAPIST NAME"]
[]
["SEMESTER"]
[]
["SITE"]
[]
["EXPECTED GRADUATION DATE"]
[null,null,"Hours of Therapy"]
["Dates","MODE OF THERAPY","UNIT/SYSTEM IN THERAPY"]
[null,null,"Individual","Couple","Family","TOTAL"]
["Beginning:","Individual",{"$f":"SUM('Therapy Hours'!C16:C202)/50","v":0},{"$f":"SUM('Therapy Hours'!D16:D202)/50","v":0},{"$f":"SUM('Therapy Hours'!E16:E202)/50","v":0},{"$f":"SUM(C14:E14)","v":0},null,null,"Total Hours of Therapy"]
[{"$f":"IF(Summary!A5=\"\", \"\", IF(AND(Summary!A5=\"Total\", Summary!F18>0), 'TOTAL Therapy'!A14, IF(AND(OR(Summary!A5=\"Fall\", Summary!A5=\"Winter\", Summary!A5=\"Spring\", Summary!A5=\"Summer\"), Summary!F18>0), 'Therapy Hours'!#REF!, \"\")))","v":""},"Group",{"$f":"IF(A5=\"Total\", SUM('TOTAL Therapy'!F14:F1000)/50, IF(OR(A5=\"Fall\", A5=\"Winter\", A5=\"Spring\", A5=\"Summer\"), SUM('Therapy Hours'!F16:F1001)/50, \"\"))","v":""},{"$f":"IF(A5=\"Total\", SUM('TOTAL Therapy'!G14:G1000)/50, IF(OR(A5=\"Fall\", A5=\"Winter\", A5=\"Spring\", A5=\"Summer\"), SUM('Therapy Hours'!G16:G1001)/50, \"\"))","v":""},{"$f":"IF(A5=\"Total\", SUM('TOTAL Therapy'!H14:H1000)/50, IF(OR(A5=\"Fall\", A5=\"Winter\", A5=\"Spring\", A5=\"Summer\"), SUM('Therapy Hours'!H16:H1001)/50, \"\"))","v":""},{"$f":"SUM(C15:E15)","v":0},null,null,null,"Individual","Relational","Combined","Program Requirements"]
{"$rows_left_out":18}
{"sheet":"Semester Summary","index":1,"n_rows":191,"n_cols":12,"rows_kept":191,"cut":false,"hidden":false,"merged":[[40,0,40,1],[40,2,40,4],[40,7,40,8],[40,9,40,11],[41,0,41,1],[41,2,41,4],[41,7,41,8],[41,9,41,11],[23,0,23,1],[34,8,34,9],[35,8,35,9],[39,0,39,1],[39,2,39,4],[39,7,39,8],[39,9,39,11],[53,0,53,1],[53,2,53,4],[53,7,53,8],[53,9,53,11],[54,0,54,1],[54,2,54,4],[54,7,54,8],[54,9,54,11],[42,0,43,0],[42,1,42,4],[42,7,43,7],[42,8,42,11],[49,4,50,4],[49,8,49,9],[50,2,50,3],[63,4,64,4],[63,8,63,9],[64,2,64,3],[67,0,67,1],[67,2,67,4],[67,7,67,8],[67,9,67,11],[55,0,55,1],[55,2,55,4],[55,7,55,8],[55,9,55,11],[56,0,57,0],[56,1,56,4],[56,7,57,7],[56,8,56,11],[70,0,71,0],[70,1,70,4],[70,7,71,7],[70,8,70,11],[77,4,78,4],[77,8,77,9],[78,2,78,3],[68,0,68,1],[68,2,68,4],[68,7,68,8],[68,9,68,11],[69,0,69,1],[69,2,69,4],[69,7,69,8],[69,9,69,11],[83,0,83,1],[83,2,83,4],[83,7,83,8],[83,9,83,11],[84,0,85,0],[84,1,84,4],[84,7,85,7],[84,8,84,11],[81,0,81,1],[81,2,81,4],[81,7,81,8],[81,9,81,11],[82,0,82,1],[82,2,82,4],[82,7,82,8],[82,9,82,11],[96,0,96,1],[96,2,96,4],[96,7,96,8],[96,9,96,11],[97,0,97,1],[97,2,97,4],[97,7,97,8],[97,9,97,11],[91,4,92,4],[91,8,91,9],[92,2,92,3],[95,0,95,1],[95,2,95,4],[95,7,95,8],[95,9,95,11],[109,0,109,1],[109,2,109,4],[109,7,109,8],[109,9,109,11],[110,0,110,1],[110,2,110,4],[110,7,110,8],[110,9,110,11],[98,0,99,0],[98,1,98,4],[98,7,99,7],[98,8,98,11],[105,4,106,4],[105,8,105,9],[106,2,106,3],[119,4,120,4],[119,8,119,9],[120,2,120,3],[123,0,123,1],[123,2,123,4],[123,7,123,8],[123,9,123,11],[111,0,111,1],[111,2,111,4],[111,7,111,8],[111,9,111,11],[112,0,113,0],[112,1,112,4],[112,7,113,7],[112,8,112,11],[126,0,127,0],[126,1,126,4],[126,7,127,7],[126,8,126,11],[133,4,134,4],[133,8,133,9],[134,2,134,3],[124,0,124,1],[124,2,124,4],[124,7,124,8],[124,9,124,11],[125,0,125,1],[125,2,125,4],[125,7,125,8],[125,9,125,11],[139,0,139,1],[139,2,139,4],[139,7,139,8],[139,9,139,11],[140,0,141,0],[140,1,140,4],[140,7,141,7],[140,8,140,11],[137,0,137,1],[137,2,137,4],[137,7,137,8],[137,9,137,11],[138,0,138,1],[138,2,138,4],[138,7,138,8],[138,9,138,11],[152,0,152,1],[152,2,152,4],[152,7,152,8],[152,9,152,11],[153,0,153,1],[153,2,153,4],[153,7,153,8],[153,9,153,11],[147,4,148,4],[147,8,147,9],[148,2,148,3],[151,0,151,1],[151,2,151,4],[151,7,151,8],[151,9,151,11],[165,0,165,1],[165,2,165,4],[165,7,165,8],[165,9,165,11],[166,0,166,1],[166,2,166,4],[166,7,166,8],[166,9,166,11],[154,0,155,0],[154,1,154,4],[154,7,155,7],[154,8,154,11],[161,4,162,4],[161,8,161,9],[162,2,162,3],[175,4,176,4],[175,8,175,9],[176,2,176,3],[179,0,179,1],[179,2,179,4],[179,7,179,8],[179,9,179,11],[167,0,167,1],[167,2,167,4],[167,7,167,8],[167,9,167,11],[168,0,169,0],[168,1,168,4],[168,7,169,7],[168,8,168,11],[182,0,183,0],[182,1,182,4],[182,7,183,7],[182,8,182,11],[189,4,190,4],[189,8,189,9],[190,2,190,3],[180,0,180,1],[180,2,180,4],[180,7,180,8],[180,9,180,11],[181,0,181,1],[181,2,181,4],[181,7,181,8],[181,9,181,11],[20,1,20,9],[17,1,17,9],[18,1,18,9],[19,1,19,9],[14,1,14,9],[15,1,16,9],[10,1,10,14],[3,1,3,14],[13,1,13,9],[4,1,4,14],[5,1,5,14],[6,1,6,14],[7,1,7,14],[8,1,8,14],[9,1,9,14]]}
["SEMESTER CLINICAL EXPERIENCE SUMMARY"]
[]
["DEFINITIONS:"]
["Therapy:","Therapy Hour - 50 minutes. Students are responsible for keeping track of therapy minutes and reporting hours at the end of each semester/term"]
[null,"Individual - One client in therapy room"]
[null,"Couple - Two clients in a therapy room where their relationship is the focus of treatment"]
[null,"Family - Two or more family members in the therapy room where their relationship is the focus of treatment (e.g. a mom holding her baby doesn't count)"]
[null,"Group Individual - Group therapy with the above definitions- individuals in attendance"]
[null,"Group Couple - Group therapy with the above definitions. Multiple couples in the group"]
[null,"Group Family - Group therapy with the above definitions. Multiple families in the group"]
[]
[]
["Supervision:","Supervision Hour - 60 minutes. Students are responsible for keeping track of supervision minutes and reporting hours at the end of each semester/term"]
[null,"Individual Live - Supervision of your cases by a supervisor directly observing your work with you and up to 1 other supervisee present."]
[null,"Individual Video - Your case(s) being reviewed by a supervisor using video tape play back with yourself and up to 1 other supervisee present."]
{"$rows_left_out":177}
{"sheet":"Therapy Hours","index":2,"n_rows":15,"n_cols":8,"rows_kept":15,"cut":false,"hidden":false,"merged":[[13,0,13,13],[0,0,0,13],[1,0,1,13],[2,0,2,13],[3,0,3,13],[4,0,4,13],[5,0,5,13],[6,0,6,13],[7,0,7,13],[10,0,10,13],[12,0,12,13],[11,0,11,13],[8,0,8,13]]}
["Reporting for Therapy Hours"]
["Guidelines:"]
["Individual - One client in therapy room"]
["Couple - Two clients in a therapy room where their relationship is the focus of treatment"]
["Family - Two or more family members in the therapy room where their relationship is the focus of treatment (e.g. a mom holding her baby doesn't count)"]
["Group Individual - Group therapy with the above definitions- individuals in attendance"]
["Group Couple - Group therapy with the above definitions. Multiple couples in the group"]
["Group Family - Group therapy with the above definitions. Multiple families in the group"]
["Therapy Hour - 50 minutes. Students are responsible for keeping track of therapy minutes and reporting hours at the end of each semester/term"]
[]
[]
[]
[]
["*INPUT IN MINUTES"]
["Date","Case #","Indiv/ Indiv","Indiv/ Couple","Indiv/ Family","Group/ Indiv.","Group/ Couple","Group/ Family"]
{"$rows_left_out":1}
{"sheet":"Supervision Hours","index":3,"n_rows":14,"n_cols":8,"rows_kept":14,"cut":false,"hidden":false,"merged":[[12,0,12,8],[0,0,0,8],[1,0,1,8],[2,0,2,8],[3,0,3,8],[6,0,6,8],[7,0,7,8],[10,0,10,8],[9,0,9,8],[4,0,5,8],[8,0,8,8]]}
["Reporting for Supervision Hours"]
["Guidelines:"]
["Individual Live - Supervision of your cases by a supervisor directly observing your work with you and up to 1 other supervisee present."]
["Individual Video - Your case(s) being reviewed by a supervisor using video tape play back with yourself and up to 1 other supervisee present."]
["Individual Case Report - Discussion of cases with 1-2 supervisees present, without any presentation of video, audio or live case material."]
[]
["Group Live - You participate in the supervision of others cases being directly observed by a supervisor with 3-6 in the group"]
["Group Video - Your observe the cases of others as they are being reviewed by a supervisor with 3 to 6 in the group."]
["Group Case Report- Discussion of cases with 3+ supervisees present, without any presentation of video, audio or live case material."]
[]
[]
["Supervision Hour - 60 minutes. Students are responsible for keeping track of supervision minutes and reporting hours at the end of each semester/term"]
["*INPUT IN MINUTES"]
["Date","Approved Supervisor Name","Indiv/ Live","Indiv/ Video","Indiv/Case Report","Group/ Live","Group/ Video","Group/Case Report"]

{"sheet":"TOTAL Therapy","index":4,"n_rows":100,"n_cols":16,"rows_kept":100,"cut":false,"hidden":false,"merged":[[12,8,12,13],[1,14,1,16],[1,0,1,13],[10,0,10,13],[11,0,11,13],[0,0,0,13],[9,0,9,13],[8,0,8,13],[7,0,7,13],[6,0,6,13],[5,0,5,13],[4,0,4,13],[3,0,3,13],[2,0,2,13]]}
["Reporting for Therapy Hours"]
["Guidelines:",null,null,null,null,null,null,null,null,null,null,null,null,null,"TOTAL THERAPY HOURS"]
["Individual - One client.",null,null,null,null,null,null,null,null,null,null,null,null,null,null,{"$f":"SUM(C14:N500)","v":0}]
["Couple - Two clients in a therapy room where their relationship is the focus of treatment."]
["Family - Two or more family members in the therapy room."]
["Group Individual - Group therapy with the above definitions."]
["Group Couple - Group therapy with the above definitions."]
["Group Family - Group therapy with the above definitions."]
[]
["Hour - 50 minutes. Keep track of therapy minutes and at the end of the semester divide by 50."]
[]
["Hours for Mode of Therapy by System in Therapy"]
["Date","Client #","Indiv/ Indiv","Indiv/ Couple","Indiv/ Family","Group/ Indiv.","Group/ Couple","Group/ Family","Do Not Enter Anything in This Box! (It should stay 0 in each cell)"]
[{"$f":"'Therapy Hours'!A16","v":"00:00:00"},{"$f":"'Therapy Hours'!B16","v":0},{"$f":"'Therapy Hours'!C16/50","v":0},{"$f":"'Therapy Hours'!D16/50","v":0},{"$f":"'Therapy Hours'!E16/50","v":0},{"$f":"'Therapy Hours'!F16/50","v":0},{"$f":"'Therapy Hours'!G16/50","v":0},{"$f":"'Therapy Hours'!H16/50","v":0},{"$f":"'Therapy Hours'!I16/50","v":0},{"$f":"'Therapy Hours'!J16/50","v":0},{"$f":"'Therapy Hours'!K16/50","v":0},{"$f":"'Therapy Hours'!L16/50","v":0},{"$f":"'Therapy Hours'!M16/50","v":0},{"$f":"'Therapy Hours'!N16/50","v":0}]
[{"$f":"'Therapy Hours'!A17","v":"00:00:00"},{"$f":"'Therapy Hours'!B17","v":0},{"$f":"'Therapy Hours'!C17/50","v":0},{"$f":"'Therapy Hours'!D17/50","v":0},{"$f":"'Therapy Hours'!E17/50","v":0},{"$f":"'Therapy Hours'!F17/50","v":0},{"$f":"'Therapy Hours'!G17/50","v":0},{"$f":"'Therapy Hours'!H17/50","v":0},{"$f":"'Therapy Hours'!I17/50","v":0},{"$f":"'Therapy Hours'!J17/50","v":0},{"$f":"'Therapy Hours'!K17/50","v":0},{"$f":"'Therapy Hours'!L17/50","v":0},{"$f":"'Therapy Hours'!M17/50","v":0},{"$f":"'Therapy Hours'!N17/50","v":0}]
{"$rows_left_out":86}
{"sheet":"TOTAL Supervision","index":5,"n_rows":107,"n_cols":11,"rows_kept":107,"cut":false,"hidden":false,"merged":[[1,9,1,11],[2,0,2,8],[1,0,1,8],[9,0,9,8],[10,0,10,8],[0,0,0,8],[8,0,8,8],[6,0,7,8],[5,0,5,8],[4,0,4,8],[3,0,3,8]]}
["Reporting for Supervision Hours"]
["Guidelines:",null,null,null,null,null,null,null,null,"TOTAL SUPERVISION HOURS"]
["Individual Live - Supervision of your cases by a supervisor directly observing your work.",null,null,null,null,null,null,null,null,null,{"$f":"SUM(C13:I300)","v":0}]
["Individual Video - Your case(s) being reviewed by a supervisor using video tape play back with 1 or 2 supervisees present."]
["Group Live - You participate in the supervision of others cases being directly observed by a supervisor."]
["Group Video - Your observe the cases of others as they are being reviewed by a supervisor with 3 to 6 in the group."]
["Individual Case Report/Process Notes and Group Case Report/Process Notes - Discussion of cases with one or two supervisees present, without presentation of video, audio or live case material."]
[]
["Team - You observe and develop treatment interventions as part of a therapeutic team."]
[]
["Hours for Mode of Therapy by System in Therapy"]
["Date","Supervisor","Indiv/ Live","Indiv/ Video","Indiv/Case Report","Group/ Live","Group/ Video","Group/Case Report","DO NOT ENTER IN BOX","<- Every cell in box should stay 0"]
[{"$f":"'Supervision Hours'!A15","v":"00:00:00"},{"$f":"'Supervision Hours'!B15","v":0},{"$f":"'Supervision Hours'!C15/60","v":0},{"$f":"'Supervision Hours'!D15/60","v":0},{"$f":"'Supervision Hours'!E15/60","v":0},{"$f":"'Supervision Hours'!F15/60","v":0},{"$f":"'Supervision Hours'!G15/60","v":0},{"$f":"'Supervision Hours'!H15/60","v":0},{"$f":"'Supervision Hours'!I15/60","v":0}]
[{"$f":"'Supervision Hours'!A16","v":"00:00:00"},{"$f":"'Supervision Hours'!B16","v":0},{"$f":"'Supervision Hours'!C16","v":0},{"$f":"'Supervision Hours'!D16","v":0},{"$f":"'Supervision Hours'!E16","v":0},{"$f":"'Supervision Hours'!F16","v":0},{"$f":"'Supervision Hours'!G16","v":0},{"$f":"'Supervision Hours'!H16","v":0},{"$f":"'Supervision Hours'!I16","v":0}]
[{"$f":"'Supervision Hours'!A17","v":"00:00:00"},{"$f":"'Supervision Hours'!B17","v":0},{"$f":"'Supervision Hours'!C17","v":0},{"$f":"'Supervision Hours'!D17","v":0},{"$f":"'Supervision Hours'!E17","v":0},{"$f":"'Supervision Hours'!F17","v":0},{"$f":"'Supervision Hours'!G17","v":0},{"$f":"'Supervision Hours'!H17","v":0},{"$f":"'Supervision Hours'!I17","v":0}]
{"$rows_left_out":93}
{"sheet":"Formula Info","index":6,"n_rows":15,"n_cols":8,"rows_kept":15,"cut":false,"hidden":false,"merged":[[0,2,0,7]]}
["Today's Date",null,"Expected Graduation Info"]
[{"$f":"TODAY()","v":"2026-07-31"},null,"Graduation","Date","Days Between Today and Grad","Weeks Between Today and Grad","Clients/Week","Clients per week message"]
[null,null,"June '26","2026-05-15",{"$f":"NETWORKDAYS(A2,D3)","v":-56},{"$f":"E3/5","v":-11.2},{"$f":"ROUNDUP(Summary!L16/'Formula Info'!F3, 1)","v":-35.800000000000004},{"$f":"_xlfn.CONCAT(G3, \" clients per week\")","v":"-35.8 clients per week"}]
[null,null,"June '27","2027-05-15",{"$f":"NETWORKDAYS(A2,D4)","v":206},41.2,{"$f":"ROUNDUP(Summary!L16/'Formula Info'!F4, 1)","v":9.7999999999999989},"9.8 clients per week"]
[null,null,"June '28","2028-05-15",{"$f":"NETWORKDAYS(A2,D5)","v":467},93.4,{"$f":"ROUNDUP(Summary!L16/'Formula Info'!F5, 1)","v":4.3},"4.3 clients per week"]
[null,null,"June '29","2029-05-15",{"$f":"NETWORKDAYS(A5,D6)","v":33752},6750.4,{"$f":"ROUNDUP(Summary!L18/'Formula Info'!F6, 1)","v":0},"0 clients per week"]
[null,null,"June '30","2030-05-15",{"$f":"NETWORKDAYS(A5,D7)","v":34013},6802.6,{"$f":"ROUNDUP(Summary!L18/'Formula Info'!F7, 1)","v":0},"0 clients per week"]
[null,null,"June '31","2031-05-15",{"$f":"NETWORKDAYS(A5,D8)","v":34274},{"$f":"E8/5","v":6854.8},{"$f":"ROUNDUP(Summary!L22/'Formula Info'!F8, 1)","v":0},{"$f":"_xlfn.CONCAT(G8, \" clients per week\")","v":"0 clients per week"}]
[null,null,"June '32","2032-05-15",{"$f":"NETWORKDAYS(A5,D9)","v":34535},6907,{"$f":"ROUNDUP(Summary!L22/'Formula Info'!F9, 1)","v":0},"0 clients per week"]
[]
[]
[]
[]
[]
["Supervisors and students should discuss policies and specific situations to determine which hours count; this may vary by supervisor. Commonly agreed-upon standards include: • Within BYU’s MFT Program, we expect Master’s Students to earn 400 face-to-face clinical hours with at least 250 of those hours being relational (with more than one client present in the room). • Basic Utah Standard (as of 2025): To obtain Associate Marriage and Family Therapist (AMFT) status in Utah, applicants must complete a clinical practicum of at least 400 hours, including at least 100 hours of face-to-face supervision and 300 direct contact hours of face-to-face supervised clinical practice, with at least 150 hours involving couples or families physically present in the therapy room. • Supervision or Practicum Hour: Typically, a full 60 minutes; 60 minutes equals 1 hour. • Individual/Dyadic Supervision: One or two students present receiving supervision from their assigned supervisor. • Therapy Hour: Fifty (50) minutes of face-to-face therapy equates to 1 hour of therapy; 60 minutes equals 1.2 hours. • Relational Therapy Hour: Involves therapy sessions conducted by you with more than 1 person (couples, families etc.) physically present in the therapy room receiving treatment • Combo Therapy/Supervision Hour: When conducting a therapy session that is supervised live, count it as one hour of therapy and one hour of live supervision"]
{"$rows_left_out":1}
{"sheet":"AmeriCorps","index":7,"n_rows":15,"n_cols":6,"rows_kept":15,"cut":false,"hidden":false,"merged":[]}
["Month","Hours","Grand Total:",{"$f":"SUM(B2:B1048576)","v":0},null,"TERM"]
["September",null,"To Go:",{"$f":"IF(F2=\"300-hour\",300-D1,IF(F2=\"450-hour\",450-D1,IF(F2=\"675-hour\",675-D1,\"\")))","v":300},null,"300-hour"]
["October"]
["November"]
["December"]
["January"]
["February"]
["March"]
["April"]
["May"]
["June"]
["July"]
["August"]
["September"]
["October"]
{"$rows_left_out":1}
{"sheet":"Definitions (September 2025)","index":8,"n_rows":18,"n_cols":1,"rows_kept":18,"cut":false,"hidden":false,"merged":[]}
[]
["The clinical practicum supervisor plays a pivotal role in students' clinical training, particularly in verifying clinical supervision hours anddirect client contact hours. Students are required to submit a log of their hours each semester or term to the part-time secretary in 234 TLRB. Failure to do so may result in a marginal or unsatisfactory student evaluation. "]
[]
["Supervisors and students should discuss policies and specific situations to determine which hours count; this may vary by supervisor. Commonly agreed-upon standards include:"]
[]
["Within BYU’s MFT Program, we expect Master’s Students to earn 400 face-to-face clinical hours with at least 250 of those hours being relational (with more than one client present in the room and their relationship the focus of therapy)."]
["Basic Utah Standard (as of 2025): To obtain Associate Marriage and Family Therapist (AMFT) status in Utah, applicants must complete a clinical practicum of at least 400 hours, including at least 100 hours of face-to-face supervision and 300 direct contact hours of face-to-face supervised clinical practice, with at least 150 hours involving couples or families physically present in thetherapy room. "]
["Supervision or Practicum Hour: Typically a full 60 minutes; 60 minutes equals 1 hour."]
["Individual/Dyadic Supervision: One or two students present receiving supervision from their assigned supervisor."]
["Therapy Hour: Fifty (50) minutes of face-to-face therapy equates to 1 hour of therapy; 60 minutes equals 1.2 hours."]
["Relational Therapy Hour: Involves therapy sessions conducted by you with more than 1 person (couples, families etc.) physically present in the therapy room receiving treatment"]
["Combo Therapy/Supervision Hour: When conducting a therapy session that is supervised live, count it as one hour of therapy and one hour of live supervision."]
["Group Individual Supervision: Occurs when you review a video of your own session during group practicum supervision."]
["Group Video Supervision: Involves watching a video of another practicum member's session during supervision group."]
["Live/Raw Supervision: Entails observation of your therapy sessions by your assigned practicum supervisor via video or behind a one-way mirror while you are present."]
{"$rows_left_out":4}
{"sheet":"Caseload Management","index":9,"n_rows":27,"n_cols":17,"rows_kept":27,"cut":false,"hidden":false,"merged":[[0,0,0,1]]}
["Today's Date",null,{"$f":"TODAY()","v":"2026-07-31"},"Sessions today",{"$f":"SUM(Q3:Q1048576)","v":0},"Last Edited"]
["Case","Type","Language","Next session scheduled?","When?","Active?","Terminating soon?","Sessions Completed","Price?","Paid? If not, how many owed?","Therapy Model","Treatment Plan Needed?","Treatment plan complete?","In PRN?","Big PRN Next?","Warned about PRN?"]
[null,null,null,{"$f":"IF(E3=\"\", \"\", IF(E3=\"TBD\",\"No\",IF(_xlfn.DAYS(E3,TODAY())<1,\"No\", \"Yes\")))","v":""},null,null,null,null,null,null,null,{"$f":"IF(H3=\"\", \"\", IF(H3>2, \"Yes\", \"No\"))","v":""},null,null,{"$f":"IF(H3=\"\", \"\", IF(OR(C3=\"SP\", C3=\"FR\", C3=\"CH\", C3=\"Other\"), \"No\", IF(OR(H3+1=1, H3+1=4, H3+1=8, H3+1=12, H3+1=16, H3+1=20, H3+1=24, H3+1=32, H3+1=40), \"Yes\", \"No\")))","v":""},null,{"$f":"IF(E3=C1, 1, \"\")","v":""}]
[null,null,null,{"$f":"IF(E4=\"\", \"\", IF(E4=\"TBD\",\"No\",IF(_xlfn.DAYS(E4,TODAY())<1,\"No\", \"Yes\")))","v":""},null,null,null,null,null,null,null,"",null,null,{"$f":"IF(H4=\"\", \"\", IF(OR(C4=\"SP\", C4=\"FR\", C4=\"CH\", C4=\"Other\"), \"No\", IF(OR(H4+1=1, H4+1=4, H4+1=8, H4+1=12, H4+1=16, H4+1=20, H4+1=24, H4+1=32, H4+1=40), \"Yes\", \"No\")))","v":""},null,{"$f":"IF(E4=C1, 1, \"\")","v":""}]
[null,null,null,"",null,null,null,null,null,null,null,"",null,null,"",null,{"$f":"IF(E5=C1, 1, \"\")","v":""}]
[null,null,null,"",null,null,null,null,null,null,null,"",null,null,"",null,{"$f":"IF(E6=C1, 1, \"\")","v":""}]
[null,null,null,"",null,null,null,null,null,null,null,"",null,null,"",null,{"$f":"IF(E7=C1, 1, \"\")","v":""}]
[null,null,null,"",null,null,null,null,null,null,null,"",null,null,"",null,{"$f":"IF(E8=C1, 1, \"\")","v":""}]
[null,null,null,"",null,null,null,null,null,null,null,"",null,null,"",null,{"$f":"IF(E9=C1, 1, \"\")","v":""}]
[null,null,null,"",null,null,null,null,null,null,null,"",null,null,"",null,{"$f":"IF(E10=C1, 1, \"\")","v":""}]
[null,null,null,"",null,null,null,null,null,null,null,"",null,null,"",null,{"$f":"IF(E11=C1, 1, \"\")","v":""}]
[null,null,null,"",null,null,null,null,null,null,null,"",null,null,"",null,{"$f":"IF(E12=C1, 1, \"\")","v":""}]
[null,null,null,"",null,null,null,null,null,null,null,"",null,null,"",null,{"$f":"IF(E13=C1, 1, \"\")","v":""}]
[null,null,null,"",null,null,null,null,null,null,null,"",null,null,"",null,{"$f":"IF(E14=C1, 1, \"\")","v":""}]
[null,null,null,"",null,null,null,null,null,null,null,"",null,null,"",null,{"$f":"IF(E15=C1, 1, \"\")","v":""}]
{"$rows_left_out":12}