{"text_format":"1","workbook":"xlsx","n_sheets":8,"sheets":["Summary","Total Therapy","Total Supervision","Semester Therapy","Semester Supervision","AmeriCorps","Caseload","Formula Info"],"not_rendered":{"charts":0,"images":0,"macros":1,"external_links":0,"defined_names":0,"comments":0,"pivot_tables":0},"unopened":[],"bounds":{"document_bytes":16777216,"sheet_cells":100000,"rows_first":2000,"rows_last":500,"rows_between":2000,"halvings":0,"cell_chars":16384,"cell_head_chars":4096},"cells_cut":0,"cells_raw":0,"read":"whole","date_system":"1900"}

{"sheet":"Summary","index":0,"n_rows":32,"n_cols":13,"rows_kept":32,"cut":false,"hidden":false,"merged":[[0,0,0,7],[11,1,12,1],[11,2,11,5],[13,8,13,12],[7,0,7,1],[10,2,10,5],[8,0,8,1],[9,0,9,1],[3,0,3,1],[4,0,4,1],[5,0,5,1],[6,0,6,1],[1,0,2,1],[31,2,31,3],[31,4,31,5],[27,3,27,4],[11,0,12,0],[23,0,24,0],[23,1,24,1],[23,2,23,5],[19,2,19,5],[22,2,22,5]]}
["Semester Clinical Experience Summary"]
[]
[]
["THERAPIST NAME"]
["Total"]
["SEMESTER"]
[]
["SITE"]
["Aug '22"]
["EXPECTED GRADUATION DATE"]
[null,null,"Hours of Therapy"]
["Dates","MODE OF THERAPY","UNIT/SYSTEM IN THERAPY"]
[null,null,"Individual","Couple","Family","TOTAL"]
["Beginning:","Individual",{"$f":"IF(A5=\"Total\", SUM('Total Therapy'!C14:C1000), IF(OR(A5=\"Fall\", A5=\"Winter\", A5=\"Spring\", A5=\"Summer\"), SUM('Semester Therapy'!C14:C999), \"\"))","v":0},{"$f":"IF(A5=\"Total\", SUM('Total Therapy'!D14:D1000), IF(OR(A5=\"Fall\", A5=\"Winter\", A5=\"Spring\", A5=\"Summer\"), SUM('Semester Therapy'!D14:D999), \"\"))","v":0},{"$f":"IF(A5=\"Total\", SUM('Total Therapy'!E14:E1000), IF(OR(A5=\"Fall\", A5=\"Winter\", A5=\"Spring\", A5=\"Summer\"), SUM('Semester Therapy'!E14:E999), \"\"))","v":0},{"$f":"SUM(C14:E14)","v":0},null,null,"Total Hours of Therapy"]
[{"$f":"IF(Summary!A5=\"\", \"\", IF(AND(Summary!A5=\"Total\", Summary!F18>0), 'Total Therapy'!A14, IF(AND(OR(Summary!A5=\"Fall\", Summary!A5=\"Winter\", Summary!A5=\"Spring\", Summary!A5=\"Summer\"), Summary!F18>0), 'Semester Therapy'!#REF!, \"\")))","v":""},"Group",{"$f":"IF(A5=\"Total\", SUM('Total Therapy'!F14:F1000), IF(OR(A5=\"Fall\", A5=\"Winter\", A5=\"Spring\", A5=\"Summer\"), SUM('Semester Therapy'!F14:F999), \"\"))","v":0},{"$f":"IF(A5=\"Total\", SUM('Total Therapy'!G14:G1000), IF(OR(A5=\"Fall\", A5=\"Winter\", A5=\"Spring\", A5=\"Summer\"), SUM('Semester Therapy'!G14:G999), \"\"))","v":0},{"$f":"IF(A5=\"Total\", SUM('Total Therapy'!H14:H1000), IF(OR(A5=\"Fall\", A5=\"Winter\", A5=\"Spring\", A5=\"Summer\"), SUM('Semester Therapy'!H14:H999), \"\"))","v":0},{"$f":"SUM(C15:E15)","v":0},null,null,null,"Individual","Relational","Combined","Program Requirements"]
[null,"Psychoeducation",{"$f":"IF(A5=\"Total\", SUM('Total Therapy'!I14:I1000), IF(OR(A5=\"Fall\", A5=\"Winter\", A5=\"Spring\", A5=\"Summer\"), SUM('Semester Therapy'!I14:I999), \"\"))","v":0},{"$f":"IF(A5=\"Total\", SUM('Total Therapy'!J14:J1000), IF(OR(A5=\"Fall\", A5=\"Winter\", A5=\"Spring\", A5=\"Summer\"), SUM('Semester Therapy'!J14:J999), \"\"))","v":0},{"$f":"IF(A5=\"Total\", SUM('Total Therapy'!K14:K1000), IF(OR(A5=\"Fall\", A5=\"Winter\", A5=\"Spring\", A5=\"Summer\"), SUM('Semester Therapy'!K14:K999), \"\"))","v":0},{"$f":"SUM(C16:E16)","v":0},null,null,"Total To Go",{"$f":"249-C18","v":249},{"$f":"251-(D18+E18)","v":251},{"$f":"500-(F18)","v":500},{"$f":"IF(L17=0, \"No info available\", IF(K17>J17, \"Relational hrs on track\", \"Need more relational hrs\"))","v":"No info available"}]
["Ending:","Team",{"$f":"IF(A5=\"Total\", SUM('Total Therapy'!L14:L1000), IF(OR(A5=\"Fall\", A5=\"Winter\", A5=\"Spring\", A5=\"Summer\"), SUM('Semester Therapy'!L14:L999), \"\"))","v":0},{"$f":"IF(A5=\"Total\", SUM('Total Therapy'!M14:M1000), IF(OR(A5=\"Fall\", A5=\"Winter\", A5=\"Spring\", A5=\"Summer\"), SUM('Semester Therapy'!M14:M999), \"\"))","v":0},{"$f":"IF(A5=\"Total\", SUM('Total Therapy'!N14:N1000), IF(OR(A5=\"Fall\", A5=\"Winter\", A5=\"Spring\", A5=\"Summer\"), SUM('Semester Therapy'!N14:N999), \"\"))","v":0},{"$f":"SUM(C17:E17)","v":0},null,null,"Total % Finished",{"$f":"(C18/250)","v":0},{"$f":"(D18+E18)/250","v":0},{"$f":"F18/500","v":0},{"$f":"IF(A9=\"\", \"Select an expected graduation date\", IF(Summary!A9='Formula Info'!C3, 'Formula Info'!H3, IF(Summary!A9='Formula Info'!C4, 'Formula Info'!H4, IF(Summary!A9='Formula Info'!C5, 'Formula Info'!H5, IF(Summary!A9='Formula Info'!C6, 'Formula Info'!H6, IF(Summary!A9='Formula Info'!C7, 'Formula Info'!H7, IF(Summary!A9='Formula Info'!C8, 'Formula Info'!H8, \"\")))))))","v":""}]
[{"$f":"IF(Summary!A5=\"\", \"\", IF(AND(Summary!A5=\"Total\", Summary!F18>0), LOOKUP(2,1/('Total Therapy'!A14:A1048576<>\"\"),'Total Therapy'!A14:A1048576), IF(AND(OR(Summary!A5=\"Fall\", Summary!A5=\"Winter\", Summary!A5=\"Spring\", Summary!A5=\"Summer\"), Summary!F18>0), LOOKUP(2,1/('Semester Therapy'!A14:A1048576<>\"\"),'Semester Therapy'!A14:A1048576), \"\")))","v":""},"TOTAL",{"$f":"SUM(C14:C17)","v":0},{"$f":"SUM(D14:D17)","v":0},{"$f":"SUM(E14:E17)","v":0},{"$f":"SUM(C18:E18)","v":0}]
[null,"% of Total",{"$f":"IF(F18=0, \"\", C18/F18)","v":""},{"$f":"IF(F18=0, \"\", D18/F18)","v":""},{"$f":"IF(F18=0, \"\", E18/F18)","v":""}]
[null,"Rel. % of Total",{"$f":"IF(AND(D19=\"\", E19=\"\"), \"\", SUM(D19+E19))","v":""}]
{"$rows_left_out":13}
{"sheet":"Total Therapy","index":1,"n_rows":100,"n_cols":14,"rows_kept":100,"cut":false,"hidden":false,"merged":[[1,0,1,13],[10,0,10,13],[11,0,11,13],[0,0,0,13],[9,0,9,13],[8,0,8,13],[7,0,7,13],[6,0,6,13],[5,0,5,13],[4,0,4,13],[3,0,3,13],[2,0,2,13]]}
["Reporting for Therapy Hours"]
["Guidelines:"]
["Individual - One client."]
["Couple - Two clients in a therapy room where their relationship is the focus of treatment."]
["Family - Two or more family members in the therapy room."]
["Group Individual - Group therapy with the above definitions."]
["Group Couple - Group therapy with the above definitions."]
["Group Family - Group therapy with the above definitions."]
["Team/Psychoeducation - See MFT policy approved September 24, 2001."]
["Hour - 50 minutes. Keep track of therapy minutes and at the end of the semester divide by 50."]
[]
["Hours for Mode of Therapy by System in Therapy"]
["Date","Client #","Indiv/ Indiv","Indiv/ Couple","Indiv/ Family","Group/ Indiv.","Group/ Couple","Group/ Family","Psychoed /Indiv.","Psychoed /Couple","Psychoed /Family","Team/ Indiv.","Team/ Couple","Team/ Family"]
[{"$f":"'Semester Therapy'!A14","v":"00:00:00"},{"$f":"'Semester Therapy'!B14","v":0},{"$f":"'Semester Therapy'!C14/50","v":0},{"$f":"'Semester Therapy'!D14/50","v":0},{"$f":"'Semester Therapy'!E14/50","v":0},{"$f":"'Semester Therapy'!F14/50","v":0},{"$f":"'Semester Therapy'!G14/50","v":0},{"$f":"'Semester Therapy'!H14/50","v":0},{"$f":"'Semester Therapy'!I14/50","v":0},{"$f":"'Semester Therapy'!J14/50","v":0},{"$f":"'Semester Therapy'!K14/50","v":0},{"$f":"'Semester Therapy'!L14/50","v":0},{"$f":"'Semester Therapy'!M14/50","v":0},{"$f":"'Semester Therapy'!N14/50","v":0}]
[{"$f":"'Semester Therapy'!A15","v":"00:00:00"},{"$f":"'Semester Therapy'!B15","v":0},{"$f":"'Semester Therapy'!C15/50","v":0},{"$f":"'Semester Therapy'!D15/50","v":0},{"$f":"'Semester Therapy'!E15/50","v":0},{"$f":"'Semester Therapy'!F15/50","v":0},{"$f":"'Semester Therapy'!G15/50","v":0},{"$f":"'Semester Therapy'!H15/50","v":0},{"$f":"'Semester Therapy'!I15/50","v":0},{"$f":"'Semester Therapy'!J15/50","v":0},{"$f":"'Semester Therapy'!K15/50","v":0},{"$f":"'Semester Therapy'!L15/50","v":0},{"$f":"'Semester Therapy'!M15/50","v":0},{"$f":"'Semester Therapy'!N15/50","v":0}]
[{"$f":"'Semester Therapy'!A16","v":"00:00:00"},{"$f":"'Semester Therapy'!B16","v":0},{"$f":"'Semester Therapy'!C16/50","v":0},{"$f":"'Semester Therapy'!D16/50","v":0},{"$f":"'Semester Therapy'!E16/50","v":0},{"$f":"'Semester Therapy'!F16/50","v":0},{"$f":"'Semester Therapy'!G16/50","v":0},{"$f":"'Semester Therapy'!H16/50","v":0},{"$f":"'Semester Therapy'!I16/50","v":0},{"$f":"'Semester Therapy'!J16/50","v":0},{"$f":"'Semester Therapy'!K16/50","v":0},{"$f":"'Semester Therapy'!L16/50","v":0},{"$f":"'Semester Therapy'!M16/50","v":0},{"$f":"'Semester Therapy'!N16/50","v":0}]
[{"$f":"'Semester Therapy'!A17","v":"00:00:00"},{"$f":"'Semester Therapy'!B17","v":0},{"$f":"'Semester Therapy'!C17/50","v":0},{"$f":"'Semester Therapy'!D17/50","v":0},{"$f":"'Semester Therapy'!E17/50","v":0},{"$f":"'Semester Therapy'!F17/50","v":0},{"$f":"'Semester Therapy'!G17/50","v":0},{"$f":"'Semester Therapy'!H17/50","v":0},{"$f":"'Semester Therapy'!I17/50","v":0},{"$f":"'Semester Therapy'!J17/50","v":0},{"$f":"'Semester Therapy'!K17/50","v":0},{"$f":"'Semester Therapy'!L17/50","v":0},{"$f":"'Semester Therapy'!M17/50","v":0},{"$f":"'Semester Therapy'!N17/50","v":0}]
[{"$f":"'Semester Therapy'!A18","v":"00:00:00"},{"$f":"'Semester Therapy'!B18","v":0},{"$f":"'Semester Therapy'!C18/50","v":0},{"$f":"'Semester Therapy'!D18/50","v":0},{"$f":"'Semester Therapy'!E18/50","v":0},{"$f":"'Semester Therapy'!F18/50","v":0},{"$f":"'Semester Therapy'!G18/50","v":0},{"$f":"'Semester Therapy'!H18/50","v":0},{"$f":"'Semester Therapy'!I18/50","v":0},{"$f":"'Semester Therapy'!J18/50","v":0},{"$f":"'Semester Therapy'!K18/50","v":0},{"$f":"'Semester Therapy'!L18/50","v":0},{"$f":"'Semester Therapy'!M18/50","v":0},{"$f":"'Semester Therapy'!N18/50","v":0}]
[{"$f":"'Semester Therapy'!A19","v":"00:00:00"},{"$f":"'Semester Therapy'!B19","v":0},{"$f":"'Semester Therapy'!C19/50","v":0},{"$f":"'Semester Therapy'!D19/50","v":0},{"$f":"'Semester Therapy'!E19/50","v":0},{"$f":"'Semester Therapy'!F19/50","v":0},{"$f":"'Semester Therapy'!G19/50","v":0},{"$f":"'Semester Therapy'!H19/50","v":0},{"$f":"'Semester Therapy'!I19/50","v":0},{"$f":"'Semester Therapy'!J19/50","v":0},{"$f":"'Semester Therapy'!K19/50","v":0},{"$f":"'Semester Therapy'!L19/50","v":0},{"$f":"'Semester Therapy'!M19/50","v":0},{"$f":"'Semester Therapy'!N19/50","v":0}]
[{"$f":"'Semester Therapy'!A20","v":"00:00:00"},{"$f":"'Semester Therapy'!B20","v":0},{"$f":"'Semester Therapy'!C20/50","v":0},{"$f":"'Semester Therapy'!D20/50","v":0},{"$f":"'Semester Therapy'!E20/50","v":0},{"$f":"'Semester Therapy'!F20/50","v":0},{"$f":"'Semester Therapy'!G20/50","v":0},{"$f":"'Semester Therapy'!H20/50","v":0},{"$f":"'Semester Therapy'!I20/50","v":0},{"$f":"'Semester Therapy'!J20/50","v":0},{"$f":"'Semester Therapy'!K20/50","v":0},{"$f":"'Semester Therapy'!L20/50","v":0},{"$f":"'Semester Therapy'!M20/50","v":0},{"$f":"'Semester Therapy'!N20/50","v":0}]
{"$rows_left_out":81}
{"sheet":"Total Supervision","index":2,"n_rows":100,"n_cols":9,"rows_kept":100,"cut":false,"hidden":false,"merged":[[2,0,2,8],[1,0,1,8],[9,0,9,8],[10,0,10,8],[0,0,0,8],[8,0,8,8],[6,0,7,8],[5,0,5,8],[4,0,4,8],[3,0,3,8]]}
["Reporting for Supervision Hours"]
["Guidelines:"]
["Individual Live - Supervision of your cases by a supervisor directly observing your work."]
["Individual Video - Your case(s) being reviewed by a supervisor using video tape play back with 1 or 2 supervisees present."]
["Group Live - You participate in the supervision of others cases being directly observed by a supervisor."]
["Group Video - Your observe the cases of others as they are being reviewed by a supervisor with 3 to 6 in the group."]
["Individual Case Report/Process Notes and Group Case Report/Process Notes - Discussion of cases with one or two supervisees present, without presentation of video, audio or live case material."]
[]
["Team - You observe and develop treatment interventions as part of a therapeutic team."]
[]
["Hours for Mode of Therapy by System in Therapy"]
["Date","Supervisor","Indiv/ Live","Indiv/ Video","Indiv/Case Report","Group/ Live","Group/ Video","Group/Case Report","Team/ Live"]
[{"$f":"'Semester Supervision'!A13","v":"00:00:00"},{"$f":"'Semester Supervision'!B13","v":0},{"$f":"'Semester Supervision'!C13/50","v":0},{"$f":"'Semester Supervision'!D13/50","v":0},{"$f":"'Semester Supervision'!E13/50","v":0},{"$f":"'Semester Supervision'!F13/50","v":0},{"$f":"'Semester Supervision'!G13/50","v":0},{"$f":"'Semester Supervision'!H13/50","v":0},{"$f":"'Semester Supervision'!I13/50","v":0}]
[{"$f":"'Semester Supervision'!A14","v":"00:00:00"},{"$f":"'Semester Supervision'!B14","v":0},{"$f":"'Semester Supervision'!C14/50","v":0},{"$f":"'Semester Supervision'!D14/50","v":0},{"$f":"'Semester Supervision'!E14/50","v":0},{"$f":"'Semester Supervision'!F14/50","v":0},{"$f":"'Semester Supervision'!G14/50","v":0},{"$f":"'Semester Supervision'!H14/50","v":0},{"$f":"'Semester Supervision'!I14/50","v":0}]
[{"$f":"'Semester Supervision'!A15","v":"00:00:00"},{"$f":"'Semester Supervision'!B15","v":0},{"$f":"'Semester Supervision'!C15/50","v":0},{"$f":"'Semester Supervision'!D15/50","v":0},{"$f":"'Semester Supervision'!E15/50","v":0},{"$f":"'Semester Supervision'!F15/50","v":0},{"$f":"'Semester Supervision'!G15/50","v":0},{"$f":"'Semester Supervision'!H15/50","v":0},{"$f":"'Semester Supervision'!I15/50","v":0}]
[{"$f":"'Semester Supervision'!A16","v":"00:00:00"},{"$f":"'Semester Supervision'!B16","v":0},{"$f":"'Semester Supervision'!C16/50","v":0},{"$f":"'Semester Supervision'!D16/50","v":0},{"$f":"'Semester Supervision'!E16/50","v":0},{"$f":"'Semester Supervision'!F16/50","v":0},{"$f":"'Semester Supervision'!G16/50","v":0},{"$f":"'Semester Supervision'!H16/50","v":0},{"$f":"'Semester Supervision'!I16/50","v":0}]
[{"$f":"'Semester Supervision'!A17","v":"00:00:00"},{"$f":"'Semester Supervision'!B17","v":0},{"$f":"'Semester Supervision'!C17/50","v":0},{"$f":"'Semester Supervision'!D17/50","v":0},{"$f":"'Semester Supervision'!E17/50","v":0},{"$f":"'Semester Supervision'!F17/50","v":0},{"$f":"'Semester Supervision'!G17/50","v":0},{"$f":"'Semester Supervision'!H17/50","v":0},{"$f":"'Semester Supervision'!I17/50","v":0}]
[{"$f":"'Semester Supervision'!A18","v":"00:00:00"},{"$f":"'Semester Supervision'!B18","v":0},{"$f":"'Semester Supervision'!C18/50","v":0},{"$f":"'Semester Supervision'!D18/50","v":0},{"$f":"'Semester Supervision'!E18/50","v":0},{"$f":"'Semester Supervision'!F18/50","v":0},{"$f":"'Semester Supervision'!G18/50","v":0},{"$f":"'Semester Supervision'!H18/50","v":0},{"$f":"'Semester Supervision'!I18/50","v":0}]
[{"$f":"'Semester Supervision'!A19","v":"00:00:00"},{"$f":"'Semester Supervision'!B19","v":0},{"$f":"'Semester Supervision'!C19/50","v":0},{"$f":"'Semester Supervision'!D19/50","v":0},{"$f":"'Semester Supervision'!E19/50","v":0},{"$f":"'Semester Supervision'!F19/50","v":0},{"$f":"'Semester Supervision'!G19/50","v":0},{"$f":"'Semester Supervision'!H19/50","v":0},{"$f":"'Semester Supervision'!I19/50","v":0}]
[{"$f":"'Semester Supervision'!A20","v":"00:00:00"},{"$f":"'Semester Supervision'!B20","v":0},{"$f":"'Semester Supervision'!C20/50","v":0},{"$f":"'Semester Supervision'!D20/50","v":0},{"$f":"'Semester Supervision'!E20/50","v":0},{"$f":"'Semester Supervision'!F20/50","v":0},{"$f":"'Semester Supervision'!G20/50","v":0},{"$f":"'Semester Supervision'!H20/50","v":0},{"$f":"'Semester Supervision'!I20/50","v":0}]
{"$rows_left_out":81}
{"sheet":"Semester Therapy","index":3,"n_rows":13,"n_cols":14,"rows_kept":13,"cut":false,"hidden":false,"merged":[[11,0,11,13],[0,0,0,13],[1,0,1,13],[2,0,2,13],[3,0,3,13],[4,0,4,13],[5,0,5,13],[6,0,6,13],[7,0,7,13],[8,0,8,13],[9,0,9,13],[10,0,10,13]]}
["Reporting for Therapy Hours"]
["Guidelines:"]
["Individual - One client."]
["Couple - Two clients in a therapy room where their relationship is the focus of treatment."]
["Family - Two or more family members in the therapy room."]
["Group Individual - Group therapy with the above definitions."]
["Group Couple - Group therapy with the above definitions."]
["Group Family - Group therapy with the above definitions."]
["Team/Psychoeducation - See MFT policy approved September 24, 2001. Reflecting Team where you are following/assigned to the case. Usually only happens in Angela's practicum."]
["Hour - 50 minutes. Keep track of therapy minutes and at the end of the semester divide by 50."]
[]
["Hours for Mode of Therapy by System in Therapy"]
["Date","Client #","Indiv/ Indiv","Indiv/ Couple","Indiv/ Family","Group/ Indiv.","Group/ Couple","Group/ Family","Psychoed /Indiv.","Psychoed /Couple","Psychoed /Family","Team/ Indiv.","Team/ Couple","Team/ Family"]

{"sheet":"Semester Supervision","index":4,"n_rows":12,"n_cols":9,"rows_kept":12,"cut":false,"hidden":false,"merged":[[10,0,10,8],[0,0,0,8],[1,0,1,8],[2,0,2,8],[3,0,3,8],[4,0,4,8],[5,0,5,8],[6,0,7,8],[8,0,8,8],[9,0,9,8]]}
["Reporting for Supervision Hours"]
["Guidelines:"]
["Individual Live - Supervision of your cases by a supervisor directly observing your work."]
["Individual Video - Your case(s) being reviewed by a supervisor using video tape play back with 1 or 2 supervisees present."]
["Group Live - You participate in the supervision of others cases being directly observed by a supervisor."]
["Group Video - Your observe the cases of others as they are being reviewed by a supervisor with 3 to 6 in the group."]
["Individual Case Report/Process Notes and Group Case Report/Process Notes - Discussion of cases with one or two supervisees present, without presentation of video, audio or live case material."]
[]
["Team - You observe and develop treatment interventions as part of a therapeutic team."]
[]
["Hours for Mode of Therapy by System in Therapy"]
["Date","Supervisor","Indiv/ Live","Indiv/ Video","Indiv/Case Report","Group/ Live","Group/ Video","Group/Case Report","Team/ Live"]

{"sheet":"AmeriCorps","index":5,"n_rows":15,"n_cols":6,"rows_kept":15,"cut":false,"hidden":false,"merged":[]}
["Month","Hours","Grand Total:",{"$f":"SUM(B2:B1048576)","v":0},null,"TERM"]
["September",null,"To Go:",{"$f":"IF(F2=\"300-hour\",300-D1,IF(F2=\"450-hour\",450-D1,IF(F2=\"675-hour\",675-D1,\"\")))","v":300},null,"300-hour"]
["October"]
["November"]
["December"]
["January"]
["February"]
["March"]
["April"]
["May"]
["June"]
["July"]
["August"]
["September"]
["October"]

{"sheet":"Caseload","index":6,"n_rows":27,"n_cols":17,"rows_kept":27,"cut":false,"hidden":false,"merged":[[0,0,0,1]]}
["Today's Date",null,{"$f":"TODAY()","v":"2022-11-28"},"Sessions today",{"$f":"SUM(Q3:Q1048576)","v":0},"Last Edited"]
["Case","Type","Language","Next session scheduled?","When?","Active?","Terminating soon?","Sessions Completed","Price?","Paid? If not, how many owed?","Therapy Model","Treatment Plan Needed?","Treatment plan complete?","In PRN?","Big PRN Next?","Warned about PRN?"]
[null,null,null,{"$f":"IF(E3=\"\", \"\", IF(E3=\"TBD\",\"No\",IF(_xlfn.DAYS(E3,TODAY())<1,\"No\", \"Yes\")))","v":""},null,null,null,null,null,null,null,{"$f":"IF(H3=\"\", \"\", IF(H3>2, \"Yes\", \"No\"))","v":""},null,null,{"$f":"IF(H3=\"\", \"\", IF(OR(C3=\"SP\", C3=\"FR\", C3=\"CH\", C3=\"Other\"), \"No\", IF(OR(H3+1=1, H3+1=4, H3+1=8, H3+1=12, H3+1=16, H3+1=20, H3+1=24, H3+1=32, H3+1=40), \"Yes\", \"No\")))","v":""},null,{"$f":"IF(E3=C1, 1, \"\")","v":""}]
[null,null,null,{"$f":"IF(E4=\"\", \"\", IF(E4=\"TBD\",\"No\",IF(_xlfn.DAYS(E4,TODAY())<1,\"No\", \"Yes\")))","v":""},null,null,null,null,null,null,null,"",null,null,{"$f":"IF(H4=\"\", \"\", IF(OR(C4=\"SP\", C4=\"FR\", C4=\"CH\", C4=\"Other\"), \"No\", IF(OR(H4+1=1, H4+1=4, H4+1=8, H4+1=12, H4+1=16, H4+1=20, H4+1=24, H4+1=32, H4+1=40), \"Yes\", \"No\")))","v":""},null,{"$f":"IF(E4=C1, 1, \"\")","v":""}]
[null,null,null,"",null,null,null,null,null,null,null,"",null,null,"",null,{"$f":"IF(E5=C1, 1, \"\")","v":""}]
[null,null,null,"",null,null,null,null,null,null,null,"",null,null,"",null,{"$f":"IF(E6=C1, 1, \"\")","v":""}]
[null,null,null,"",null,null,null,null,null,null,null,"",null,null,"",null,{"$f":"IF(E7=C1, 1, \"\")","v":""}]
[null,null,null,"",null,null,null,null,null,null,null,"",null,null,"",null,{"$f":"IF(E8=C1, 1, \"\")","v":""}]
[null,null,null,"",null,null,null,null,null,null,null,"",null,null,"",null,{"$f":"IF(E9=C1, 1, \"\")","v":""}]
[null,null,null,"",null,null,null,null,null,null,null,"",null,null,"",null,{"$f":"IF(E10=C1, 1, \"\")","v":""}]
[null,null,null,"",null,null,null,null,null,null,null,"",null,null,"",null,{"$f":"IF(E11=C1, 1, \"\")","v":""}]
[null,null,null,"",null,null,null,null,null,null,null,"",null,null,"",null,{"$f":"IF(E12=C1, 1, \"\")","v":""}]
[null,null,null,"",null,null,null,null,null,null,null,"",null,null,"",null,{"$f":"IF(E13=C1, 1, \"\")","v":""}]
[null,null,null,"",null,null,null,null,null,null,null,"",null,null,"",null,{"$f":"IF(E14=C1, 1, \"\")","v":""}]
[null,null,null,"",null,null,null,null,null,null,null,"",null,null,"",null,{"$f":"IF(E15=C1, 1, \"\")","v":""}]
[null,null,null,"",null,null,null,null,null,null,null,"",null,null,"",null,{"$f":"IF(E16=C1, 1, \"\")","v":""}]
[null,null,null,"",null,null,null,null,null,null,null,"",null,null,"",null,{"$f":"IF(E17=C1, 1, \"\")","v":""}]
[null,null,null,"",null,null,null,null,null,null,null,"",null,null,"",null,{"$f":"IF(E18=C1, 1, \"\")","v":""}]
[null,null,null,"",null,null,null,null,null,null,null,"",null,null,"",null,{"$f":"IF(E19=C1, 1, \"\")","v":""}]
[null,null,null,{"$f":"IF(E20=\"\", \"\", IF(E20=\"TBD\",\"No\",IF(_xlfn.DAYS(E20,TODAY())<1,\"No\", \"Yes\")))","v":""},null,null,null,null,null,null,null,"",null,null,"",null,{"$f":"IF(E20=C1, 1, \"\")","v":""}]
{"$rows_left_out":8}
{"sheet":"Formula Info","index":7,"n_rows":8,"n_cols":8,"rows_kept":8,"cut":false,"hidden":false,"merged":[[0,2,0,7]]}
["Today's Date",null,"Expected Graduation Info"]
[{"$f":"TODAY()","v":"2022-11-28"},null,"Graduation","Date","Days Between Today and Grad","Weeks Between Today and Grad","Clients/Week","Clients per week message"]
[null,null,"Aug '23","2023-07-01",{"$f":"NETWORKDAYS(A2,D3)","v":155},{"$f":"E3/5","v":31},{"$f":"ROUNDUP(Summary!L12/'Formula Info'!F3, 1)","v":0},{"$f":"_xlfn.CONCAT(G3, \" clients per week\")","v":"0 clients per week"}]
[null,null,"Aug '24","2024-07-01",{"$f":"NETWORKDAYS(A2,D4)","v":416},83.2,{"$f":"ROUNDUP(Summary!L12/'Formula Info'!F4, 1)","v":0},"0 clients per week"]
[null,null,"Aug '25","2025-07-01",{"$f":"NETWORKDAYS(A2,D5)","v":677},{"$f":"E5/5","v":135.4},{"$f":"ROUNDUP(Summary!L16/'Formula Info'!F5, 1)","v":3.7},{"$f":"_xlfn.CONCAT(G5, \" clients per week\")","v":"3.7 clients per week"}]
[null,null,"Aug '26","2026-07-01",{"$f":"NETWORKDAYS(A2,D6)","v":938},187.6,{"$f":"ROUNDUP(Summary!L16/'Formula Info'!F6, 1)","v":2.7},"2.7 clients per week"]
[null,null,"Aug '27","2027-07-01",{"$f":"NETWORKDAYS(A2,D7)","v":1199},239.8,{"$f":"ROUNDUP(Summary!L16/'Formula Info'!F7, 1)","v":2.1},"2.1 clients per week"]
[null,null,"Aug '28","2028-07-01",{"$f":"NETWORKDAYS(A2,D8)","v":1460},292,{"$f":"ROUNDUP(Summary!L16/'Formula Info'!F8, 1)","v":1.8},"1.8 clients per week"]